Home > Jcl Error > Jcl Error 552

Jcl Error 552

Contents

The requested size was %ld. [ERROR_PAGEFILE_CREATE_FAILED (0x240)]Error Code 577: Windows cannot verify the digital signature for this file. This error was returned by the server on which the file exists. All rights reserved. COBOL intercepts this and displays "QSAM error, status 92". have a peek here

The problem is I don't even know which file exactly should I enter in //PARMS DD DISP=SHR,DSN=THE.FILE.NAME What this should do is, the JCL should call a function called Billing, Program has taken more CPU time than the default limit for        the JOB Class could indicate an infinite loop S522    -    JOB or TSO session exceeded maximum job wait It used 0.10 CPU seconds and 0.71 megabytes of allocated storage. End of Fault Analyzer report (2011/12/15 20:30:38). ******************************** BOTTOM OF DATA ******************************** Select all Open The User-process is discouraged from repeating the exact request (in the same sequence). http://ibmmainframes.com/about41225.html

Jcl Error Codes

If you've just created the dataset whose name is in the PARMS DD statement in the JCL, make sure that the data within it is of exactly the correct format. Once you know what the system error code means (below) then you can work on fixing the problem.1 - 1118 | 1119 - 1935 | 1936 - 8250 | 8251 - The remaining data will be sent later. [ERROR_RECEIVE_PARTIAL_EXPEDITED (0x2C5)]Error Code 710: {TDI Event Done} The TDI indication has completed successfully. [ERROR_EVENT_DONE (0x2C6)]Error Code 711: {TDI Event Pending} The TDI indication has

if you are not a cobol programmer or mainframe developer you need to speak Go to Solution 13 3 +2 5 Participants adkry(13 comments) momi_sabag(3 comments) LVL 37 DB227 Mainframe OS4 May need a JOBLIB or STEPLIB.  S0C1 Executing a program with an unresolved external reference. File name not allowed. 600 Series Replies regarding confidentiality and integrity 631 Integrity protected reply. 632 Confidentiality and integrity protected reply. 633 Confidentiality protected reply. 10000 Series Common Winsock Error Codes No dump was requested.  S322 The job used more CPU time than it should have.

Explains how to use the server or the meaning of a particular non-standard command. Mainframe Abend Codes List Pdf Please try to save this file elsewhere. [ERROR_LOST_WRITEBEHIND_DATA_NETWORK_DISCONNECTED (0x314)]Error Code 789: {Delayed Write Failed} Windows was unable to save all the data for the file %hs; the data has been lost. Logged out if appropriate. 231 User logged out; service terminated. 232 Logout command noted, will complete when transfer done. 234 Specifies that the server accepts the authentication mechanism specified by the https://www.ibm.com/support/knowledgecenter/SSLTBW_2.2.0/com.ibm.zos.v2r2.ieam700/m008267.htm This system will shutdown in 1 hour.

During this process [ERROR_COMMITMENT_MINIMUM (0x27B)]Error Code 636: A device was removed so enumeration must be restarted. [ERROR_PNP_RESTART_ENUMERATION (0x27C)]Error Code 637: {Fatal System Error} The system image %s is not properly signed. SYSOUT IEF285I UK00164.BILLING.JOB02053.D0000105.? Your cache administrator is webmaster. Data is not numeric, but should be.

Mainframe Abend Codes List Pdf

Additional storage requests will be ignored. [ERROR_REGISTRY_QUOTA_LIMIT (0x265)]Error Code 614: A callback return system service cannot be executed when no callback is active. [ERROR_NO_CALLBACK_ACTIVE (0x266)]Error Code 615: The password provided is https://en.wikipedia.org/wiki/List_of_FTP_server_return_codes you will need to allocate that file in your job it will look something like //PARMS DD DISP=SHR,DSN=THE.FILE.NAME 0 Message Assisted Solution by:adkry2011-12-15 adkry earned 0 total points Comment Jcl Error Codes HAS BEEN PLACED IN CHECK PENDING   SQLCODE  203, Warning: THE QUALIFIED COLUMN NAME  WAS RESOLVED USING A NON-UNIQUE OR UNEXPOSED NAME   SQLCODE  204, Warning:  IS AN UNDEFINED NAME   Ftp Return Codes Mainframe REASON   SQLCODE  -919, Error: A ROLLBACK OPERATION IS REQUIRED   SQLCODE  -918, Error: THE SQL STATEMENT CANNOT BE EXECUTED BECAUSE A CONNECTION HAS BEEN LOST   SQLCODE  -917, Error: BIND

Windows is increasing the size of your virtual memory paging file. navigate here REASON CODE   SQLCODE  -112, Error: THE OPERAND OF A COLUMN FUNCTION IS ANOTHER COLUMN FUNCTION   SQLCODE  -111, Error: A COLUMN FUNCTION DOES NOT INCLUDE A COLUMN NAME   SQLCODE  I've got JCL code to apply a function on a DB2 database. SYSIN IEF285I UK00164.BILLING.JOB02053.D0000102.?

Therefore the service control manager cannot take action if this service's process terminates unexpectedly. [ERROR_CANNOT_DETECT_PROCESS_ABORT (0x439)]Error Code 1082: No recovery program has been configured for this service. [ERROR_NO_RECOVERY_PROGRAM (0x43A)]Error Code 1083: To use all processors the operating system restricts itself to the features of the least capable processor in the system. DBRM or PACKAGE not found in PLAN -811     -           Cursor should be used, when more than one row returned as a result of a singleton          SELECT query -818     -           http://wirelessready.org/jcl-error/jcl-error-686.html To restore access to this installation of Windows [ERROR_EVALUATION_EXPIRATION (0x26E)]Error Code 623: {Illegal System DLL Relocation} The system DLL %hs was relocated in memory.

An alternative [ERROR_DLL_MIGHT_BE_INSECURE (0x2AE)]Error Code 687: The application is loading executable code from the module %hs. S0C1    -    Operation Exception. Insufficient storage space in system.File unavailable (e.g., file busy). 500 Series Syntax error, command unrecognized and the requested action did not take place.

Reading a file that is not open Your SORTIN DCB was not correct Mixing compile options RES and NORES in different modules  S0C4 An uncontrolled loop moved data on top of

Please contact your system vendor for system BIOS update. [ERROR_PNP_BAD_MPS_TABLE (0x29F)]Error Code 672: A translator failed to translate resources. [ERROR_PNP_TRANSLATION_FAILED (0x2A0)]Error Code 673: A IRQ translator failed to translate resources. [ERROR_PNP_IRQ_TRANSLATION_FAILED This device will not be used. SYSOUT IEF142I BILLING BILLING - STEP WAS EXECUTED - COND CODE 0012 IGD104I DB2.V9R1.SDSNLOAD RETAINED, DDNAME=STEPLIB IGD104I ZOS.CONTEST2.PART2.LOAD RETAINED, DDNAME= IGD104I ZOS.CONTEST2.PART2.CUSTOMER.DATA RETAINED, DDNAME=PARMS IEF285I UK00164.BILLING.JOB02053.D0000101.? See linkage editor report that put the program on library  S806 Program not on the library.

Calling/called programs have different length for items passed in Linkage Section with COBOL Sort, doing a STOP RUN or GOBACK while an input or output procedure is still running  S0C5 See The request cannot be fulfilled by the server The request cannot be fulfilled by the server mainframesguru.inSearch this site JCL ABEND CodesCICS ABEND CodesCICS Interview QuestionsCOBOL Interview QuestionsDB2 Architecture and SYSIN IEF285I UK00164.BILLING.JOB02065.D0000102.? this contact form SYSOUT IEF285I UK00164.BILLING.JOB03617.D0000105.?

The IOCTL_SERIAL_XOFF_COUNTER did not reach zero.) [ERROR_COUNTER_TIMEOUT (0x461)]Error Code 1122: No ID address mark was found on the floppy disk. [ERROR_FLOPPY_ID_MARK_NOT_FOUND (0x462)]Error Code 1123: Mismatch between the floppy disk sector ID This causes the protection attempt to fail [ERROR_NO_GUID_TRANSLATION (0x230)]Error Code 561: Indicates that an attempt was made to grow an LDT by setting its size [ERROR_INVALID_LDT_SIZE (0x231)]Error Code 563: Indicates that S0C7 Program attempting to do math on illegal data. Bad exit from a perform statement SOC7    -    1.

Select OK to set current directory to %hs [ERROR_BAD_CURRENT_DIRECTORY (0x2BF)]Error Code 704: {Redundant Read} To satisfy a read request [ERROR_FT_READ_RECOVERY_FROM_BACKUP (0x2C0)]Error Code 705: {Redundant Write} To satisfy a write request [ERROR_FT_WRITE_RECOVERY NAME- TOTAL CPU TIME= .00 TOTAL ELAPSED TIME= .02 12.08.37 JOB03617 $HASP395 BILLING ENDED 0------ JES2 JOB STATISTICS ------ - 16 DEC 2011 JOB EXECUTION DATE - 26 CARDS READ Its execution time was 0.55 seconds. Please check the system eventlog for additional information. [ERROR_MCA_OCCURED (0x28B)]Error Code 652: There was error [%2] processing the driver database. [ERROR_DRIVER_DATABASE_ERROR (0x28C)]Error Code 653: System hive size has exceeded its limit.

SYSIN IEF285I UK00000.BILLING.JOB04060.D0000102.? Close an un-opened dataset     3.